Target
ATP-binding cassette sub-family C member 4
Ligand
BDBM87351
Substrate
Meas. Tech.
ChEMBL_1678647 (CHEMBL4028924)
IC50
7430±n/a nM
Citation
 Morgan, REvan Staden, CJChen, YKalyanaraman, NKalanzi, JDunn, RTAfshari, CAHamadeh, HK A multifactorial approach to hepatobiliary transporter assessment enables improved therapeutic compound development. Toxicol Sci 136:216-41 (2013)  
Target
Name:
ATP-binding cassette sub-family C member 4
Synonyms:
ABCC4 MOAT-B MRP/cMOAT-related ABC transporter MRP4_HUMAN Multidrug resistance-associated protein 4
Type:
PROTEIN
Mol. Mass.:
149546.12
Organism:
Homo sapiens (Human)
Description:
ChEMBL_1486828
Residue:
1325
  
Inhibitor
Name:
BDBM87351
Synonyms:
Amsacrine hydrochloride MLS002153376 N-[4-(acridin-9-ylamino)-3-methoxy-phenyl]methanesulfonamide;hydrochloride N-[4-(acridin-9-ylamino)-3-methoxyphenyl]methanesulfonamide;hydrochloride cid_148673 | m-AMSA
Type:
Small organic molecule
Emp. Form.:
C21H19N3O3S
Mol. Mass.:
393.459
SMILES:
COc1cc(NS(C)(=O)=O)ccc1Nc1c2ccccc2nc2ccccc12
: