Target
ATP-binding cassette sub-family C member 3
Ligand
BDBM50030448
Substrate
Meas. Tech.
ChEMBL_1678646 (CHEMBL4028923)
IC50
>133000±n/a nM
Citation
 Morgan, REvan Staden, CJChen, YKalyanaraman, NKalanzi, JDunn, RTAfshari, CAHamadeh, HK A multifactorial approach to hepatobiliary transporter assessment enables improved therapeutic compound development. Toxicol Sci 136:216-41 (2013)  
Target
Name:
ATP-binding cassette sub-family C member 3
Synonyms:
ABCC3 CMOAT2 MLP2 MRP3 Multi-specific organic anion transporter D | Multidrug resistance-associated protein 3
Type:
PROTEIN
Mol. Mass.:
169352.45
Organism:
Homo sapiens (Human)
Description:
ChEMBL_735421
Residue:
1527
  
Inhibitor
Name:
BDBM50030448
Synonyms:
8-DEETHYL-8-[BUT-3-ENYL]-ASCOMYCIN TACROLIMUS
Type:
Small organic molecule
Emp. Form.:
C44H69NO12
Mol. Mass.:
804.0182
SMILES:
CO[C@@H]1C[C@@H](CC[C@H]1O)\C=C(/C)[C@H]1OC(=O)[C@@H]2CCCCN2C(=O)C(=O)[C@]2(O)O[C@@H]([C@H](C[C@H]2C)OC)[C@H](C[C@@H](C)C\C(C)=C\[C@@H](CC=C)C(=O)C[C@H](O)[C@H]1C)OC
: