Target
Bile salt export pump
Ligand
BDBM50020856
Substrate
Meas. Tech.
ChEMBL_1678644 (CHEMBL4028921)
IC50
>133000±n/a nM
Citation
 Morgan, REvan Staden, CJChen, YKalyanaraman, NKalanzi, JDunn, RTAfshari, CAHamadeh, HK A multifactorial approach to hepatobiliary transporter assessment enables improved therapeutic compound development. Toxicol Sci 136:216-41 (2013)  
Target
Name:
Bile salt export pump
Synonyms:
ABCB11 ATP-binding cassette sub-family B member 11 Bile Salt Export Pump, BSEP Bile salt export pump (BSEP)
Type:
Protein
Mol. Mass.:
146405.49
Organism:
Homo sapiens (Human)
Description:
O95342
Residue:
1321
  
Inhibitor
Name:
BDBM50020856
Synonyms:
7-Nitro-5-phenyl-1,3-dihydro-benzo[e][1,4]diazepin-2-one CHEMBL13209 | NITRAZEPAM
Type:
Small organic molecule
Emp. Form.:
C15H11N3O3
Mol. Mass.:
281.2661
SMILES:
[O-][N+](=O)c1ccc2NC(=O)CN=C(c3ccccc3)c2c1
: