Target
ATP-binding cassette sub-family C member 4
Ligand
BDBM48449
Substrate
Meas. Tech.
ChEMBL_1678647 (CHEMBL4028924)
IC50
8080±n/a nM
Citation
 Morgan, REvan Staden, CJChen, YKalyanaraman, NKalanzi, JDunn, RTAfshari, CAHamadeh, HK A multifactorial approach to hepatobiliary transporter assessment enables improved therapeutic compound development. Toxicol Sci 136:216-41 (2013)  
Target
Name:
ATP-binding cassette sub-family C member 4
Synonyms:
ABCC4 MOAT-B MRP/cMOAT-related ABC transporter MRP4_HUMAN Multidrug resistance-associated protein 4
Type:
PROTEIN
Mol. Mass.:
149546.12
Organism:
Homo sapiens (Human)
Description:
ChEMBL_1486828
Residue:
1325
  
Inhibitor
Name:
BDBM48449
Synonyms:
3-(3,4-DIHYDROXYPHENYL)-2-METHYL-L-ALANINE MLS000028644 cid_38853
Type:
Small organic molecule
Emp. Form.:
C10H13NO4
Mol. Mass.:
211.2145
SMILES:
C[C@](N)(Cc1ccc(O)c(O)c1)C(O)=O
: