Target
Growth hormone-releasing hormone receptor
Ligand
BDBM50004965
Substrate
Meas. Tech.
ChEMBL_72520 (CHEMBL857393)
IC50
1000±n/a nM
Citation
 Gaudreau, PBoulanger, LAbribat, T Affinity of human growth hormone-releasing factor (1-29)NH2 analogues for GRF binding sites in rat adenopituitary. J Med Chem 35:1864-9 (1992)  
Target
Name:
Growth hormone-releasing hormone receptor
Synonyms:
GHRH receptor GRF receptor Grfr
Type:
PROTEIN
Mol. Mass.:
51523.38
Organism:
Rattus norvegicus
Description:
ChEMBL_193173
Residue:
464
  
Inhibitor
Name:
BDBM50004965
Synonyms:
CHEMBL269263 | GRF-analogues
Type:
Small organic molecule
Emp. Form.:
C134H217N37O39S
Mol. Mass.:
3002.446
SMILES:
CC[C@H](C)[C@H](NC(=O)[C@H](C)NC(=O)[C@H](CC(O)=O)NC(=O)[C@H](C)NC(=O)[C@@H](N)Cc1ccc(O)cc1)C(=O)N[C@@H](Cc1ccccc1)C(=O)N[C@@H]([C@@H](C)O)C(=O)N[C@@H](CC(N)=O)C(=O)N[C@@H](CO)C(=O)N[C@@H](Cc1ccc(O)cc1)C(=O)N[C@@H](CCCNC(N)=N)C(=O)N[C@@H](CCCCN)C(=O)N[C@@H](C(C)C)C(=O)N[C@@H](CC(C)C)C(=O)NCC(=O)N[C@@H](CCC(N)=O)C(=O)N[C@@H](CC(C)C)C(=O)N[C@@H](CO)C(=O)N[C@@H](CC(C)C)C(=O)N[C@@H](CC(C)C)C(=O)N[C@@H](CCC(N)=O)C(=O)N[C@@H](CC(O)=O)C(=O)N[C@@H]([C@@H](C)CC)C(=O)N[C@@H](CCSC)C(=O)N[C@@H](CO)C(=O)N[C@@H](CCCNC(N)=N)C(N)=O
: