Target
Glutamate receptor ionotropic, NMDA 1
Ligand
BDBM50005062
Substrate
Meas. Tech.
ChEBML_141849
IC50
39±n/a nM
Citation
 Leeson, PDCarling, RWMoore, KWMoseley, AMSmith, JDStevenson, GChan, TBaker, RFoster, ACGrimwood, S 4-Amido-2-carboxytetrahydroquinolines. Structure-activity relationships for antagonism at the glycine site of the NMDA receptor. J Med Chem 35:1954-68 (1992)  
Target
Name:
Glutamate receptor ionotropic, NMDA 1
Synonyms:
Glutamate (NMDA) receptor subunit zeta 1 Glutamate-NMDA-Channel Glutamate-NMDA-Polyamine NMDA Nmdar1 | phencyclidine
Type:
Enzyme Catalytic Domain
Mol. Mass.:
105533.40
Organism:
RAT
Description:
P35439
Residue:
938
  
Inhibitor
Name:
BDBM50005062
Synonyms:
5,7-Dichloro-4-[2-(4-methoxy-phenyl)-acetylamino]-1,2,3,4-tetrahydro-quinoline-2-carboxylic acid | CHEMBL293021
Type:
Small organic molecule
Emp. Form.:
C19H18Cl2N2O4
Mol. Mass.:
409.263
SMILES:
COc1ccc(CC(=O)N[C@H]2C[C@@H](Nc3cc(Cl)cc(Cl)c23)C(O)=O)cc1
: