Target
Glutamate receptor ionotropic, NMDA 1
Ligand
BDBM50406626
Substrate
Meas. Tech.
ChEBML_141849
IC50
7000±n/a nM
Citation
 Leeson, PDCarling, RWMoore, KWMoseley, AMSmith, JDStevenson, GChan, TBaker, RFoster, ACGrimwood, S 4-Amido-2-carboxytetrahydroquinolines. Structure-activity relationships for antagonism at the glycine site of the NMDA receptor. J Med Chem 35:1954-68 (1992)  
Target
Name:
Glutamate receptor ionotropic, NMDA 1
Synonyms:
Glutamate (NMDA) receptor subunit zeta 1 Glutamate-NMDA-Channel Glutamate-NMDA-Polyamine NMDA Nmdar1 | phencyclidine
Type:
Enzyme Catalytic Domain
Mol. Mass.:
105533.40
Organism:
RAT
Description:
P35439
Residue:
938
  
Inhibitor
Name:
BDBM50406626
Synonyms:
CHEMBL2115077
Type:
Small organic molecule
Emp. Form.:
C19H19Cl2N3O3
Mol. Mass.:
408.278
SMILES:
N[C@H](Cc1ccccc1)C(=O)N[C@H]1C[C@@H](Nc2cc(Cl)cc(Cl)c12)C(O)=O
: