Target
Glutamate receptor ionotropic, NMDA 1
Ligand
BDBM50005081
Substrate
Meas. Tech.
ChEMBL_141849 (CHEMBL749328)
IC50
11±n/a nM
Citation
 Leeson, PDCarling, RWMoore, KWMoseley, AMSmith, JDStevenson, GChan, TBaker, RFoster, ACGrimwood, S 4-Amido-2-carboxytetrahydroquinolines. Structure-activity relationships for antagonism at the glycine site of the NMDA receptor. J Med Chem 35:1954-68 (1992)  
Target
Name:
Glutamate receptor ionotropic, NMDA 1
Synonyms:
Glutamate (NMDA) receptor subunit zeta 1 Glutamate-NMDA-Channel Glutamate-NMDA-Polyamine NMDA Nmdar1 | phencyclidine
Type:
Enzyme Catalytic Domain
Mol. Mass.:
105533.40
Organism:
RAT
Description:
P35439
Residue:
938
  
Inhibitor
Name:
BDBM50005081
Synonyms:
5,7-Dichloro-4-(3-naphthalen-1-yl-ureido)-1,2,3,4-tetrahydro-quinoline-2-carboxylic acid | CHEMBL61125
Type:
Small organic molecule
Emp. Form.:
C21H17Cl2N3O3
Mol. Mass.:
430.284
SMILES:
OC(=O)[C@H]1C[C@H](NC(=O)Nc2cccc3ccccc23)c2c(Cl)cc(Cl)cc2N1
: