Target
Sphingosine 1-phosphate receptor 1
Ligand
BDBM50248369
Substrate
Meas. Tech.
ChEMBL_1679181 (CHEMBL4029458)
Ki
0.800000±n/a nM
Citation
 Dyckman, AJ Modulators of Sphingosine-1-phosphate Pathway Biology: Recent Advances of Sphingosine-1-phosphate Receptor 1 (S1P J Med Chem 60:5267-5289 (2017)  
Target
Name:
Sphingosine 1-phosphate receptor 1
Synonyms:
CHEDG1 Endothelial differentiation G-protein coupled receptor 1 S1P1 S1PR1_HUMAN Sphingosine 1-phosphate receptor Edg-1
Type:
Enzyme
Mol. Mass.:
42836.02
Organism:
Homo sapiens (Human)
Description:
P21453
Residue:
382
  
Inhibitor
Name:
BDBM50248369
Synonyms:
CHEMBL4076530
Type:
Small organic molecule
Emp. Form.:
C25H22N2O5
Mol. Mass.:
430.4526
SMILES:
COCc1cc(ccc1-c1ccccc1C)-c1nc(no1)-c1cccc(OCC(O)=O)c1
: