Target
Sphingosine 1-phosphate receptor 3
Ligand
BDBM50248369
Substrate
Meas. Tech.
ChEMBL_1679182 (CHEMBL4029459)
Ki
1040±n/a nM
Citation
 Dyckman, AJ Modulators of Sphingosine-1-phosphate Pathway Biology: Recent Advances of Sphingosine-1-phosphate Receptor 1 (S1P J Med Chem 60:5267-5289 (2017)  
Target
Name:
Sphingosine 1-phosphate receptor 3
Synonyms:
C9orf108 EDG3 S1P receptor 3 S1P3 S1PR3_HUMAN Sphingosine 1-phosphate receptor 3 (S1P3) | Sphingosine 1-phosphate receptor Edg-3
Type:
G Protein-Coupled Receptor (GPCR)
Mol. Mass.:
42278.13
Organism:
Homo sapiens (Human)
Description:
Q99500
Residue:
378
  
Inhibitor
Name:
BDBM50248369
Synonyms:
CHEMBL4076530
Type:
Small organic molecule
Emp. Form.:
C25H22N2O5
Mol. Mass.:
430.4526
SMILES:
COCc1cc(ccc1-c1ccccc1C)-c1nc(no1)-c1cccc(OCC(O)=O)c1
: