Target
Serine/threonine-protein kinase pim-1
Ligand
BDBM50248893
Substrate
Meas. Tech.
ChEMBL_1679402 (CHEMBL4029679)
IC50
2.9±n/a nM
Citation
 Bataille, CJBrennan, MBByrne, SDavies, SGDurbin, MFedorov, OHuber, KVJones, AMKnapp, SLiu, GNadali, AQuevedo, CERussell, AJWalker, RGWestwood, RWynne, GM Thiazolidine derivatives as potent and selective inhibitors of the PIM kinase family. Bioorg Med Chem 25:2657-2665 (2017)  
Target
Name:
Serine/threonine-protein kinase pim-1
Synonyms:
PIM-1 Kinase PIM1_HUMAN Serine/threonine-protein kinase (PIM1) Serine/threonine-protein kinase PIM1 | Serine/threonine-protein kinase pim-1 (PIM1)
Type:
Protein
Mol. Mass.:
35681.82
Organism:
Homo sapiens (Human)
Description:
P11309
Residue:
313
  
Inhibitor
Name:
BDBM50248893
Synonyms:
CHEMBL4104431
Type:
Small organic molecule
Emp. Form.:
C14H7F3N2O2S3
Mol. Mass.:
388.408
SMILES:
FC(F)(F)Oc1ccc(cc1)-c1nc(\C=C2/SC(=S)NC2=O)cs1
: