Target
Renin
Ligand
BDBM50005307
Substrate
Meas. Tech.
ChEBML_195740
IC50
157±n/a nM
Citation
 Ocain, TDDeininger, DDRusso, RSenko, NAKatz, AKitzen, JMMitchell, ROshiro, GRusso, AStupienski, R New modified heterocyclic phenylalanine derivatives. Incorporation into potent inhibitors of human renin. J Med Chem 35:823-32 (1992)  
Target
Name:
Renin
Synonyms:
Angiotensinogenase RENI_HUMAN
Type:
Enzyme
Mol. Mass.:
45058.99
Organism:
Homo sapiens (Human)
Description:
Residue:
406
  
Inhibitor
Name:
BDBM50005307
Synonyms:
4-Cyclohexyl-2-hydroxy-3-{4-methyl-2-[2-(2-oxo-pyrrolidin-1-yl)-3-phenyl-propionylamino]-pentanoylamino}-butyric acid isopropyl ester | CHEMBL353900
Type:
Small organic molecule
Emp. Form.:
C32H49N3O6
Mol. Mass.:
571.748
SMILES:
CC(C)CC(NC(=O)[C@H](Cc1ccccc1)N1CCCC1=O)C(=O)N[C@@H](CC1CCCCC1)C(O)C(=O)OC(C)C
: