Target
Thymidylate synthase
Ligand
BDBM50005328
Substrate
Meas. Tech.
ChEBML_209652
Ki
7700±n/a nM
Citation
 Reich, SHFuhry, MANguyen, DPino, MJWelsh, KMWebber, SJanson, CAJordan, SRMatthews, DASmith, WW Design and synthesis of novel 6,7-imidazotetrahydroquinoline inhibitors of thymidylate synthase using iterative protein crystal structure analysis. J Med Chem 35:847-58 (1992)  
Target
Name:
Thymidylate synthase
Synonyms:
TS TYMS Thymidylate synthase (TS) | Thymidylate synthase/GAR transformylase/AICAR transformylase
Type:
Enzyme
Mol. Mass.:
35718.07
Organism:
Homo sapiens (Human)
Description:
Residue:
313
  
Inhibitor
Name:
BDBM50005328
Synonyms:
5-[4-(Piperazine-1-sulfonyl)-benzyl]-5,6,7,8-tetrahydro-1H-imidazo[4,5-g]quinoline CHEMBL353700
Type:
Small organic molecule
Emp. Form.:
C21H25N5O2S
Mol. Mass.:
411.521
SMILES:
O=S(=O)(N1CCNCC1)c1ccc(CN2CCCc3cc4nc[nH]c4cc23)cc1
: