Target
Thymidylate synthase
Ligand
BDBM50005327
Substrate
Meas. Tech.
ChEBML_209652
Ki
51±n/a nM
Citation
 Reich, SHFuhry, MANguyen, DPino, MJWelsh, KMWebber, SJanson, CAJordan, SRMatthews, DASmith, WW Design and synthesis of novel 6,7-imidazotetrahydroquinoline inhibitors of thymidylate synthase using iterative protein crystal structure analysis. J Med Chem 35:847-58 (1992)  
Target
Name:
Thymidylate synthase
Synonyms:
TS TYMS Thymidylate synthase (TS) | Thymidylate synthase/GAR transformylase/AICAR transformylase
Type:
Enzyme
Mol. Mass.:
35718.07
Organism:
Homo sapiens (Human)
Description:
Residue:
313
  
Inhibitor
Name:
BDBM50005327
Synonyms:
5-[4-(4-Methoxy-benzenesulfonyl)-benzyl]-1-methyl-5,6,7,8-tetrahydro-1H-imidazo[4,5-g]quinolin-2-ylamine | CHEMBL171057
Type:
Small organic molecule
Emp. Form.:
C25H26N4O3S
Mol. Mass.:
462.564
SMILES:
COc1ccc(cc1)S(=O)(=O)c1ccc(CN2CCCc3cc4n(C)c(N)nc4cc23)cc1
: