Target
Advanced glycosylation end product-specific receptor
Ligand
BDBM50249568
Substrate
Meas. Tech.
ChEMBL_1680052 (CHEMBL4030329)
IC50
<500±n/a nM
Citation
 Bongarzone, SSavickas, VLuzi, FGee, AD Targeting the Receptor for Advanced Glycation Endproducts (RAGE): A Medicinal Chemistry Perspective. J Med Chem 60:7213-7232 (2017)  
Target
Name:
Advanced glycosylation end product-specific receptor
Synonyms:
AGER RAGE_HUMAN | Receptor for advanced glycosylation end products
Type:
PROTEIN
Mol. Mass.:
42800.11
Organism:
Homo sapiens (Human)
Description:
ChEMBL_1339877
Residue:
404
  
Inhibitor
Name:
BDBM50249568
Synonyms:
CHEMBL4068269
Type:
Small organic molecule
Emp. Form.:
C47H60N4O5
Mol. Mass.:
761.0031
SMILES:
CCCCOc1cc(OCCCN(CC)CC)ccc1NC(=O)C(CC1CCN(Cc2ccccc2)CC1)NC(=O)OCC1c2ccccc2-c2ccccc12
: