Target
Advanced glycosylation end product-specific receptor
Ligand
BDBM50249576
Substrate
Meas. Tech.
ChEBML_1680057
Kd
4.0±n/a nM
Citation
 Bongarzone, SSavickas, VLuzi, FGee, AD Targeting the Receptor for Advanced Glycation Endproducts (RAGE): A Medicinal Chemistry Perspective. J Med Chem 60:7213-7232 (2017)  
Target
Name:
Advanced glycosylation end product-specific receptor
Synonyms:
AGER RAGE_HUMAN | Receptor for advanced glycosylation end products
Type:
PROTEIN
Mol. Mass.:
42800.11
Organism:
Homo sapiens (Human)
Description:
ChEMBL_1339877
Residue:
404
  
Inhibitor
Name:
BDBM50249576
Synonyms:
CHEMBL4075539 | US10729695, Compound CD-6
Type:
Small organic molecule
Emp. Form.:
C23H21N3O2
Mol. Mass.:
371.4317
SMILES:
Cn1c2ccccc2n(CC(O)Cn2c3ccccc3c3ccccc23)c1=O
: