Target
Renin
Ligand
BDBM50005424
Substrate
Meas. Tech.
ChEMBL_196280 (CHEMBL806634)
IC50
500±n/a nM
Citation
 Repine, JTKaltenbronn, JSDoherty, AMHamby, JMHimmelsbach, RJKornberg, BETaylor, MDLunney, EAHumblet, CRapundalo, ST Renin inhibitors containing alpha-heteroatom amino acids as P2 residues. J Med Chem 35:1032-42 (1992)  
Target
Name:
Renin
Synonyms:
Angiotensinogenase RENI_HUMAN
Type:
Enzyme
Mol. Mass.:
45058.99
Organism:
Homo sapiens (Human)
Description:
Residue:
406
  
Inhibitor
Name:
BDBM50005424
Synonyms:
3-Hydroxy-4-[2-isopropylamino-2-(3-naphthalen-1-yl-2-naphthalen-1-ylmethyl-propionylamino)-acetylamino]-6-methyl-heptanoic acid (2-methyl-butyl)-amide | CHEMBL3350020
Type:
Small organic molecule
Emp. Form.:
C42H56N4O4
Mol. Mass.:
680.9184
SMILES:
CC[C@H](C)CNC(=O)C[C@H](O)[C@H](CC(C)C)NC(=O)C(NC(C)C)NC(=O)C(Cc1cccc2ccccc12)Cc1cccc2ccccc12
: