Target
Renin
Ligand
BDBM50005442
Substrate
Meas. Tech.
ChEBML_192717
IC50
0.220000±n/a nM
Citation
 Repine, JTKaltenbronn, JSDoherty, AMHamby, JMHimmelsbach, RJKornberg, BETaylor, MDLunney, EAHumblet, CRapundalo, ST Renin inhibitors containing alpha-heteroatom amino acids as P2 residues. J Med Chem 35:1032-42 (1992)  
Target
Name:
Renin
Synonyms:
Angiotensinogenase RENI_HUMAN
Type:
Enzyme
Mol. Mass.:
45058.99
Organism:
Homo sapiens (Human)
Description:
Residue:
406
  
Inhibitor
Name:
BDBM50005442
Synonyms:
CHEMBL262712 | N-[Allyloxy-(1-cyclohexylmethyl-2,3-dihydroxy-5-methyl-hexylcarbamoyl)-methyl]-2-(morpholine-4-sulfonylamino)-3-phenyl-propionamide
Type:
Small organic molecule
Emp. Form.:
C32H52N4O8S
Mol. Mass.:
652.842
SMILES:
CC(C)C[C@H](O)[C@H](O)[C@H](CC1CCCCC1)NC(=O)C(NC(=O)[C@H](Cc1ccccc1)NS(=O)(=O)N1CCOCC1)OCC=C
: