Target
Cathepsin D
Ligand
BDBM50005425
Substrate
Meas. Tech.
ChEBML_44969
IC50
60±n/a nM
Citation
 Repine, JTKaltenbronn, JSDoherty, AMHamby, JMHimmelsbach, RJKornberg, BETaylor, MDLunney, EAHumblet, CRapundalo, ST Renin inhibitors containing alpha-heteroatom amino acids as P2 residues. J Med Chem 35:1032-42 (1992)  
Target
Name:
Cathepsin D
Synonyms:
CATD_BOVIN | CTSD
Type:
PROTEIN
Mol. Mass.:
42158.92
Organism:
Bos taurus
Description:
ChEMBL_1458606
Residue:
387
  
Inhibitor
Name:
BDBM50005425
Synonyms:
(1-{[(Allyl-methyl-amino)-(1-cyclohexylmethyl-2,3-dihydroxy-5-methyl-hexylcarbamoyl)-methyl]-carbamoyl}-2-phenyl-ethyl)-carbamic acid tert-butyl ester | CHEMBL418519
Type:
Small organic molecule
Emp. Form.:
C34H56N4O6
Mol. Mass.:
616.8316
SMILES:
CC(C)C[C@H](O)[C@H](O)[C@H](CC1CCCCC1)NC(=O)C(NC(=O)[C@H](Cc1ccccc1)NC(=O)OC(C)(C)C)N(C)CC=C
: