Target
Cholecystokinin receptor type A
Ligand
BDBM50005460
Substrate
Meas. Tech.
ChEMBL_47648 (CHEMBL657360)
Ki
>2000±n/a nM
Citation
 van der Bent, ABlommaert, AGMelman, CTIJzerman, APvan Wijngaarden, ISoudijn, W Hybrid cholecystokinin-A antagonists based on molecular modeling of lorglumide and L-364,718. J Med Chem 35:1042-9 (1992)  
Target
Name:
Cholecystokinin receptor type A
Synonyms:
CCKAR_RAT Cholecystokinin peripheral Cholecystokinin receptor type A
Type:
Enzyme Catalytic Domain
Mol. Mass.:
49676.37
Organism:
RAT
Description:
Cholecystokinin central 0 RAT::P30551
Residue:
444
  
Inhibitor
Name:
BDBM50005460
Synonyms:
5,6-Dihydro-4H-pyrrolo[3,2,1-ij]quinoline-2-carboxylic acid (3,3-diphenyl-allyl)-amide | CHEMBL416144
Type:
Small organic molecule
Emp. Form.:
C27H24N2O
Mol. Mass.:
392.4923
SMILES:
O=[#6](-[#7]-[#6]\[#6]=[#6](/c1ccccc1)-c1ccccc1)-c1cc2cccc3-[#6]-[#6]-[#6]-n1c23
: