Target
Muscarinic acetylcholine receptor M4
Ligand
BDBM50005680
Substrate
Meas. Tech.
ChEBML_139121
Ki
173±n/a nM
Citation
 Leader, HGordon, RKBaumgold, JBoyd, VLNewman, AHSmejkal, RMChiang, PK Muscarinic receptor subtype specificity of (N,N-dialkylamino)alkyl 2-cyclohexyl-2-phenylpropionates: cylexphenes (cyclohexyl-substituted aprophen analogues). J Med Chem 35:1290-5 (1992)  
Target
Name:
Muscarinic acetylcholine receptor M4
Synonyms:
ACM4_HUMAN Cholinergic, muscarinic M4 Muscarinic acetylcholine receptor M2 and M4
Type:
Enzyme Catalytic Domain
Mol. Mass.:
53079.31
Organism:
Homo sapiens (Human)
Description:
Cholinergic, muscarinic M4 CHRM4 HUMAN M3::P08173
Residue:
479
  
Inhibitor
Name:
BDBM50005680
Synonyms:
2-Cyclohexyl-2-phenyl-propionic acid 5-diethylamino-pentyl ester | CHEMBL24369
Type:
Small organic molecule
Emp. Form.:
C24H39NO2
Mol. Mass.:
373.572
SMILES:
CCN(CC)CCCCCOC(=O)C(C)(C1CCCCC1)c1ccccc1
: