Target
Pancreatic alpha-amylase
Ligand
BDBM50005686
Substrate
Meas. Tech.
ChEBML_34104
IC50
52±n/a nM
Citation
 Leader, HGordon, RKBaumgold, JBoyd, VLNewman, AHSmejkal, RMChiang, PK Muscarinic receptor subtype specificity of (N,N-dialkylamino)alkyl 2-cyclohexyl-2-phenylpropionates: cylexphenes (cyclohexyl-substituted aprophen analogues). J Med Chem 35:1290-5 (1992)  
Target
Name:
Pancreatic alpha-amylase
Synonyms:
1,4-alpha-D-glucan glucanohydrolase Amy2 | PA
Type:
PROTEIN
Mol. Mass.:
57186.64
Organism:
Rattus norvegicus
Description:
ChEMBL_34101
Residue:
508
  
Inhibitor
Name:
BDBM50005686
Synonyms:
2-Cyclohexyl-2-phenyl-propionic acid 2-diethylamino-ethyl ester | CHEMBL443780
Type:
Small organic molecule
Emp. Form.:
C21H33NO2
Mol. Mass.:
331.4922
SMILES:
CCN(CC)CCOC(=O)C(C)(C1CCCCC1)c1ccccc1
: