Target
Muscarinic acetylcholine receptor M2
Ligand
BDBM50005680
Substrate
Meas. Tech.
ChEBML_139754
Ki
246±n/a nM
Citation
 Leader, HGordon, RKBaumgold, JBoyd, VLNewman, AHSmejkal, RMChiang, PK Muscarinic receptor subtype specificity of (N,N-dialkylamino)alkyl 2-cyclohexyl-2-phenylpropionates: cylexphenes (cyclohexyl-substituted aprophen analogues). J Med Chem 35:1290-5 (1992)  
Target
Name:
Muscarinic acetylcholine receptor M2
Synonyms:
ACM2_HUMAN Cholinergic, muscarinic M2 Muscarinic acetylcholine receptor M2 and M5 | RecName: Full=Muscarinic acetylcholine receptor M2
Type:
GPCR
Mol. Mass.:
51730.61
Organism:
Homo sapiens (Human)
Description:
P08172
Residue:
466
  
Inhibitor
Name:
BDBM50005680
Synonyms:
2-Cyclohexyl-2-phenyl-propionic acid 5-diethylamino-pentyl ester | CHEMBL24369
Type:
Small organic molecule
Emp. Form.:
C24H39NO2
Mol. Mass.:
373.572
SMILES:
CCN(CC)CCCCCOC(=O)C(C)(C1CCCCC1)c1ccccc1
: