Target
Ornithine decarboxylase
Ligand
BDBM50005721
Substrate
Meas. Tech.
ChEBML_148124
IC50
8400±n/a nM
Citation
 Stanek, JFrei, JMett, HSchneider, PRegenass, U 2-substituted 3-(aminooxy)propanamines as inhibitors of ornithine decarboxylase: synthesis and biological activity. J Med Chem 35:1339-44 (1992)  
Target
Name:
Ornithine decarboxylase
Synonyms:
DCOR_RAT Odc1
Type:
PROTEIN
Mol. Mass.:
51037.04
Organism:
Rattus norvegicus
Description:
ChEMBL_1344641
Residue:
461
  
Inhibitor
Name:
BDBM50005721
Synonyms:
1-Aminooxy-3-prop-2-ynylamino-propan-2-ol | CHEMBL26669
Type:
Small organic molecule
Emp. Form.:
C6H12N2O2
Mol. Mass.:
144.1717
SMILES:
NOCC(O)CNCC#C
: