Target
Trifunctional purine biosynthetic protein adenosine-3
Ligand
BDBM50005736
Substrate
Meas. Tech.
ChEBML_69927
IC50
6600±n/a nM
Citation
 Bigham, ECHodson, SJMallory, WRWilson, DDuch, DSSmith, GKFerone, R Synthesis and biological activity of open-chain analogues of 5,6,7,8-tetrahydrofolic acid--potential antitumor agents. J Med Chem 35:1399-410 (1992)  
Target
Name:
Trifunctional purine biosynthetic protein adenosine-3
Synonyms:
GAR Tfase GART Glycinamide ribonucleotide transformylase (GAR Tfase) PRGS Thymidylate synthase/GAR transformylase/AICAR transformylase
Type:
Protein
Mol. Mass.:
107768.47
Organism:
Homo sapiens (Human)
Description:
P22102
Residue:
1010
  
Inhibitor
Name:
BDBM50005736
Synonyms:
2-{2-Chloro-4-[3-(2,4-diamino-6-oxo-1,6-dihydro-pyrimidin-5-yl)-propylamino]-benzoylamino}-pentanedioic acid | CHEMBL417304
Type:
Small organic molecule
Emp. Form.:
C19H23ClN6O6
Mol. Mass.:
466.876
SMILES:
Nc1nc(N)c(CCCNc2ccc(C(=O)NC(CCC(O)=O)C(O)=O)c(Cl)c2)c(=O)[nH]1
: