Target
Aromatic-L-amino-acid decarboxylase
Ligand
BDBM50005741
Substrate
Meas. Tech.
ChEMBL_59432 (CHEMBL670451)
Ki
330000±n/a nM
Citation
 Ahmad, SPhillips, RSStammer, CH Inhibition of pig kidney L-aromatic amino acid decarboxylase by 2,3-methano-m-tyrosines. J Med Chem 35:1410-7 (1992)  
Target
Name:
Aromatic-L-amino-acid decarboxylase
Synonyms:
DDC DOPA decarboxylase
Type:
PROTEIN
Mol. Mass.:
53939.21
Organism:
Sus scrofa
Description:
ChEMBL_59433
Residue:
486
  
Inhibitor
Name:
BDBM50005741
Synonyms:
(+)-1-Amino-2-(3-hydroxy-phenyl)-cyclopropanecarboxylic acid | CHEMBL2368534
Type:
Small organic molecule
Emp. Form.:
C10H11NO3
Mol. Mass.:
193.1992
SMILES:
N[C@@]1(C[C@@H]1c1cccc(O)c1)C(O)=O
: