Target
Muscarinic acetylcholine receptor
Ligand
BDBM50005845
Substrate
Meas. Tech.
ChEBML_138320
Ki
26000±n/a nM
Citation
 Nordvall, GSundquist, SGlas, GGogoll, ANilvebrant, LHacksell, U Analogues of the muscarinic agent 2'-methylspiro[1-azabicyclo[2.2.2]octane-3,4'-[1,3]dioxolane]: synthesis and pharmacology. J Med Chem 35:1541-50 (1992)  
Target
Name:
Muscarinic acetylcholine receptor
Synonyms:
GPM3 | Muscarinic acetylcholine receptor M3
Type:
Mol. Mass.:
66272.13
Organism:
Cavia porcellus
Description:
Residue:
587
  
Inhibitor
Name:
BDBM50005845
Synonyms:
(2S,5'S)-5'-methyldihydrospiro[4-azabicyclo[2.2.2]octane-2,3'-furan] | CHEMBL38423
Type:
Small organic molecule
Emp. Form.:
C11H19NO
Mol. Mass.:
181.2747
SMILES:
C[C@H]1CC2(CO1)CN1CCC2CC1
: