Target
Muscarinic acetylcholine receptor M1
Ligand
BDBM50455987
Substrate
Meas. Tech.
ChEBML_138957
Ki
3030±n/a nM
Citation
 Garvey, DSWasicak, JTChung, JYShue, YKCarrera, GMMay, PDMcKinney, MMAnderson, DCadman, EVella-Rountree, L Synthesis and in vitro characterization of novel amino terminally modified oxotremorine derivatives for brain muscarinic receptors. J Med Chem 35:1550-7 (1992)  
Target
Name:
Muscarinic acetylcholine receptor M1
Synonyms:
ACM1_RAT Chrm-1 cholinergic receptor, muscarinic 1
Type:
Enzyme Catalytic Domain
Mol. Mass.:
51390.46
Organism:
RAT
Description:
P08482
Residue:
460
  
Inhibitor
Name:
BDBM50455987
Synonyms:
CHEMBL2115360
Type:
Small organic molecule
Emp. Form.:
C13H20N2O
Mol. Mass.:
220.3107
SMILES:
O=C1CCCN1CC#CC[C@H]1CCCCN1
: