Target
Muscarinic acetylcholine receptor M2
Ligand
BDBM50455986
Substrate
Meas. Tech.
ChEBML_140188
Ki
3660±n/a nM
Citation
 Garvey, DSWasicak, JTChung, JYShue, YKCarrera, GMMay, PDMcKinney, MMAnderson, DCadman, EVella-Rountree, L Synthesis and in vitro characterization of novel amino terminally modified oxotremorine derivatives for brain muscarinic receptors. J Med Chem 35:1550-7 (1992)  
Target
Name:
Muscarinic acetylcholine receptor M2
Synonyms:
ACM2_RAT Chrm-2 | Chrm2
Type:
Enzyme Catalytic Domain
Mol. Mass.:
51555.53
Organism:
RAT
Description:
P10980
Residue:
466
  
Inhibitor
Name:
BDBM50455986
Synonyms:
CHEMBL2115361
Type:
Small organic molecule
Emp. Form.:
C14H22N2O
Mol. Mass.:
234.3373
SMILES:
CN1CCCC[C@@H]1CC#CCN1CCCC1=O
: