Target
Renin
Ligand
BDBM50006183
Substrate
Meas. Tech.
ChEMBL_195918 (CHEMBL803387)
pH
7.4±n/a
IC50
83±n/a nM
Comments
extracted
Citation
 Boyd, SAFung, AKBaker, WRMantei, RAArmiger, YLStein, HHCohen, JEgan, DABarlow, JLKlinghofer, V C-terminal modifications of nonpeptide renin inhibitors: improved oral bioavailability via modification of physicochemical properties. J Med Chem 35:1735-46 (1992)  
Target
Name:
Renin
Synonyms:
Angiotensinogenase RENI_HUMAN
Type:
Enzyme
Mol. Mass.:
45058.99
Organism:
Homo sapiens (Human)
Description:
Residue:
406
  
Inhibitor
Name:
BDBM50006183
Synonyms:
(4-{2-[1-Benzyl-2-(4-methoxymethoxy-piperidin-1-yl)-2-oxo-ethoxy]-hexanoylamino}-5-cyclohexyl-3-hydroxy-1-isopropyl-pentyl)-carbamic acid benzyl ester | CHEMBL50217
Type:
Small organic molecule
Emp. Form.:
C44H67N3O8
Mol. Mass.:
766.0181
SMILES:
CCCC[C@H](O[C@@H](Cc1ccccc1)C(=O)N1CCC(CC1)OCOC)C(=O)N[C@@H](CC1CCCCC1)[C@@H](O)C[C@H](NC(=O)OCc1ccccc1)C(C)C
: