Target
Renin
Ligand
BDBM50006211
Substrate
Meas. Tech.
ChEMBL_195918 (CHEMBL803387)
pH
7.4±n/a
IC50
17±n/a nM
Comments
extracted
Citation
 Boyd, SAFung, AKBaker, WRMantei, RAArmiger, YLStein, HHCohen, JEgan, DABarlow, JLKlinghofer, V C-terminal modifications of nonpeptide renin inhibitors: improved oral bioavailability via modification of physicochemical properties. J Med Chem 35:1735-46 (1992)  
Target
Name:
Renin
Synonyms:
Angiotensinogenase RENI_HUMAN
Type:
Enzyme
Mol. Mass.:
45058.99
Organism:
Homo sapiens (Human)
Description:
Residue:
406
  
Inhibitor
Name:
BDBM50006211
Synonyms:
CHEMBL49218 | {4-[2-(2-tert-Butoxycarbonylamino-3-phenyl-propionylamino)-3-(1H-imidazol-4-yl)-propionylamino]-5-cyclohexyl-3-hydroxy-1-isopropyl-pentyl}-carbamic acid 2-pyridin-2-yl-ethyl ester
Type:
Small organic molecule
Emp. Form.:
C42H61N7O7
Mol. Mass.:
775.9764
SMILES:
CC(C)[C@H](C[C@H](O)[C@H](CC1CCCCC1)NC(=O)[C@H](Cc1cnc[nH]1)NC(=O)[C@H](Cc1ccccc1)NC(=O)OC(C)(C)C)NC(=O)OCCc1ccccn1
: