Target
Adenosylhomocysteinase
Ligand
BDBM50006218
Substrate
Meas. Tech.
ChEBML_196726
Ki
12±n/a nM
Citation
 Wolfe, MSLee, YBartlett, WJBorcherding, DRBorchardt, RT 4'-modified analogues of aristeromycin and neplanocin A: synthesis and inhibitory activity toward S-adenosyl-L-homocysteine hydrolase. J Med Chem 35:1782-91 (1992)  
Target
Name:
Adenosylhomocysteinase
Synonyms:
AHCY SAHH | SAHH_HUMAN
Type:
PROTEIN
Mol. Mass.:
47714.06
Organism:
Homo sapiens (Human)
Description:
ChEMBL_1507791
Residue:
432
  
Inhibitor
Name:
BDBM50006218
Synonyms:
(1R,2S,3R)-3-(6-amino-9H-purin-9-yl)cyclopentane-1,2-diol CHEMBL301499
Type:
Small organic molecule
Emp. Form.:
C10H13N5O2
Mol. Mass.:
235.2425
SMILES:
Nc1ncnc2n(cnc12)[C@@H]1CC[C@@H](O)[C@H]1O
: