Target
Adenosylhomocysteinase
Ligand
BDBM50006223
Substrate
Meas. Tech.
ChEBML_196726
Ki
9150±n/a nM
Citation
 Wolfe, MSLee, YBartlett, WJBorcherding, DRBorchardt, RT 4'-modified analogues of aristeromycin and neplanocin A: synthesis and inhibitory activity toward S-adenosyl-L-homocysteine hydrolase. J Med Chem 35:1782-91 (1992)  
Target
Name:
Adenosylhomocysteinase
Synonyms:
AHCY SAHH | SAHH_HUMAN
Type:
PROTEIN
Mol. Mass.:
47714.06
Organism:
Homo sapiens (Human)
Description:
ChEMBL_1507791
Residue:
432
  
Inhibitor
Name:
BDBM50006223
Synonyms:
5-(6-Amino-purin-9-yl)-3-methyl-cyclopent-3-ene-1,2-diol | CHEMBL299135
Type:
Small organic molecule
Emp. Form.:
C11H13N5O2
Mol. Mass.:
247.2532
SMILES:
CC1=C[C@H]([C@H](O)[C@@H]1O)n1cnc2c(N)ncnc12
: