Target
Muscarinic acetylcholine receptor M1
Ligand
BDBM50006244
Substrate
Meas. Tech.
ChEBML_138940
Ki
18600±n/a nM
Citation
 De Amici, MDallanoce, CDe Micheli, CGrana, EBarbieri, ALadinsky, HSchiavi, GZonta, F Synthesis and pharmacological investigation of the enantiomers of muscarone and allomuscarone. J Med Chem 35:1915-20 (1992)  
Target
Name:
Muscarinic acetylcholine receptor M1
Synonyms:
ACM1_RAT Chrm-1 cholinergic receptor, muscarinic 1
Type:
Enzyme Catalytic Domain
Mol. Mass.:
51390.46
Organism:
RAT
Description:
P08482
Residue:
460
  
Inhibitor
Name:
BDBM50006244
Synonyms:
CHEMBL294470 | Trimethyl-(5-methyl-4-oxo-tetrahydro-furan-2-ylmethyl)-ammonium; iodide
Type:
Small organic molecule
Emp. Form.:
C9H18NO2
Mol. Mass.:
172.2442
SMILES:
C[C@H]1O[C@@H](C[N+](C)(C)C)CC1=O
: