Target
Muscarinic acetylcholine receptor M3
Ligand
BDBM50006248
Substrate
Meas. Tech.
ChEMBL_138855 (CHEMBL748616)
Ki
252000±n/a nM
Citation
 De Amici, MDallanoce, CDe Micheli, CGrana, EBarbieri, ALadinsky, HSchiavi, GZonta, F Synthesis and pharmacological investigation of the enantiomers of muscarone and allomuscarone. J Med Chem 35:1915-20 (1992)  
Target
Name:
Muscarinic acetylcholine receptor M3
Synonyms:
ACM3_RAT Chrm-3 | Chrm3
Type:
Enzyme Catalytic Domain
Mol. Mass.:
66086.66
Organism:
RAT
Description:
Cholinergic, muscarinic M3 CHRM3 RAT::P08483
Residue:
589
  
Inhibitor
Name:
BDBM50006248
Synonyms:
(4-Hydroxy-5-methyl-tetrahydro-furan-2-ylmethyl)-trimethyl-ammonium; iodide | CHEMBL301699
Type:
Small organic molecule
Emp. Form.:
C9H20NO2
Mol. Mass.:
174.2601
SMILES:
C[C@H]1O[C@@H](C[N+](C)(C)C)C[C@@H]1O
: