Target
Aldo-keto reductase family 1 member B1
Ligand
BDBM50006405
Substrate
Meas. Tech.
ChEBML_31912
IC50
2000±n/a nM
Citation
 Yamagishi, MYamada, YOzaki, KAsao, MShimizu, RSuzuki, MMatsumoto, MMatsuoka, YMatsumoto, K Biological activities and quantitative structure-activity relationships of spiro[imidazolidine-4,4'(1'H)-quinazoline]-2,2',5(3'H)-triones as aldose reductase inhibitors. J Med Chem 35:2085-94 (1992)  
Target
Name:
Aldo-keto reductase family 1 member B1
Synonyms:
AKR1B1 ALDR_HUMAN AR Aldose Reductase (ALR2) Aldose reductase (AR)
Type:
Protein
Mol. Mass.:
35855.50
Organism:
Homo sapiens (Human)
Description:
P15121. 4LAU; 2IKI; 4LB4; 2FZD; 2FZ8; 1US0
Residue:
316
  
Inhibitor
Name:
BDBM50006405
Synonyms:
3'-methyl-2,2',5-trioxo-2',3'-dihydro-1'H-spiro[imidazolidine-4,4'-quinazolin]-6'-yl benzoate | CHEMBL304050
Type:
Small organic molecule
Emp. Form.:
C18H14N4O5
Mol. Mass.:
366.3276
SMILES:
CN1C(=O)Nc2ccc(OC(=O)c3ccccc3)cc2C11NC(=O)NC1=O
: