Target
Renin
Ligand
BDBM50006419
Substrate
Meas. Tech.
ChEBML_196103
IC50
207±n/a nM
Citation
 Ashton, WTCantone, CLMeurer, LCTolman, RLGreenlee, WJPatchett, AALynch, RJSchorn, TWStrouse, JFSiegl, PK Renin inhibitors containing C-termini derived from mercaptoheterocycles. J Med Chem 35:2103-12 (1992)  
Target
Name:
Renin
Synonyms:
Angiotensinogenase RENI_HUMAN
Type:
Enzyme
Mol. Mass.:
45058.99
Organism:
Homo sapiens (Human)
Description:
Residue:
406
  
Inhibitor
Name:
BDBM50006419
Synonyms:
(5-{3-[2-(2-tert-Butoxycarbonylamino-3-phenyl-propionylamino)-3-(1H-imidazol-4-yl)-propionylamino]-4-cyclohexyl-2-hydroxy-butylsulfanyl}-tetrazol-1-yl)-acetic acid ethyl ester | CHEMBL291671
Type:
Small organic molecule
Emp. Form.:
C35H51N9O7S
Mol. Mass.:
741.901
SMILES:
CCOC(=O)Cn1nnnc1SC[C@H](O)[C@H](CC1CCCCC1)NC(=O)[C@H](Cc1cnc[nH]1)NC(=O)[C@H](Cc1ccccc1)NC(=O)OC(C)(C)C
: