Target
Renin
Ligand
BDBM50006436
Substrate
Meas. Tech.
ChEBML_196103
IC50
81±n/a nM
Citation
 Ashton, WTCantone, CLMeurer, LCTolman, RLGreenlee, WJPatchett, AALynch, RJSchorn, TWStrouse, JFSiegl, PK Renin inhibitors containing C-termini derived from mercaptoheterocycles. J Med Chem 35:2103-12 (1992)  
Target
Name:
Renin
Synonyms:
Angiotensinogenase RENI_HUMAN
Type:
Enzyme
Mol. Mass.:
45058.99
Organism:
Homo sapiens (Human)
Description:
Residue:
406
  
Inhibitor
Name:
BDBM50006436
Synonyms:
CHEMBL66684 | {1-[1-[1-Cyclohexylmethyl-2-hydroxy-3-(4-methyl-4H-[1,2,4]triazol-3-ylsulfanyl)-propylcarbamoyl]-2-(1H-imidazol-4-yl)-ethylcarbamoyl]-2-phenyl-ethyl}-carbamic acid tert-butyl ester
Type:
Small organic molecule
Emp. Form.:
C33H48N8O5S
Mol. Mass.:
668.85
SMILES:
Cn1cnnc1SC[C@H](O)[C@H](CC1CCCCC1)NC(=O)[C@H](Cc1cnc[nH]1)NC(=O)[C@H](Cc1ccccc1)NC(=O)OC(C)(C)C
: