Target
Renin
Ligand
BDBM50006438
Substrate
Meas. Tech.
ChEBML_196103
IC50
39±n/a nM
Citation
 Ashton, WTCantone, CLMeurer, LCTolman, RLGreenlee, WJPatchett, AALynch, RJSchorn, TWStrouse, JFSiegl, PK Renin inhibitors containing C-termini derived from mercaptoheterocycles. J Med Chem 35:2103-12 (1992)  
Target
Name:
Renin
Synonyms:
Angiotensinogenase RENI_HUMAN
Type:
Enzyme
Mol. Mass.:
45058.99
Organism:
Homo sapiens (Human)
Description:
Residue:
406
  
Inhibitor
Name:
BDBM50006438
Synonyms:
CHEMBL305761 | {1-[1-[1-Cyclohexylmethyl-2-hydroxy-3-(4-methyl-5-trifluoromethyl-4H-[1,2,4]triazol-3-ylsulfanyl)-propylcarbamoyl]-2-(1H-imidazol-4-yl)-ethylcarbamoyl]-2-phenyl-ethyl}-carbamic acid tert-butyl ester
Type:
Small organic molecule
Emp. Form.:
C34H47F3N8O5S
Mol. Mass.:
736.848
SMILES:
Cn1c(SC[C@H](O)[C@H](CC2CCCCC2)NC(=O)[C@H](Cc2cnc[nH]2)NC(=O)[C@H](Cc2ccccc2)NC(=O)OC(C)(C)C)nnc1C(F)(F)F
: