Target
Aldo-keto reductase family 1 member B1
Ligand
BDBM50006468
Substrate
Meas. Tech.
ChEBML_31769
IC50
100±n/a nM
Citation
 Mylari, BLZembrowski, WJBeyer, TAAldinger, CESiegel, TW Orally active aldose reductase inhibitors: indazoleacetic, oxopyridazineacetic, and oxopyridopyridazineacetic acid derivatives. J Med Chem 35:2155-62 (1992)  
Target
Name:
Aldo-keto reductase family 1 member B1
Synonyms:
AKR1B1 ALDR_HUMAN AR Aldose Reductase (ALR2) Aldose reductase (AR)
Type:
Protein
Mol. Mass.:
35855.50
Organism:
Homo sapiens (Human)
Description:
P15121. 4LAU; 2IKI; 4LB4; 2FZD; 2FZ8; 1US0
Residue:
316
  
Inhibitor
Name:
BDBM50006468
Synonyms:
(1-Benzooxazol-2-ylmethyl-5-chloro-1H-indazol-3-yl)-acetic acid | CHEMBL69907
Type:
Small organic molecule
Emp. Form.:
C17H12ClN3O3
Mol. Mass.:
341.748
SMILES:
OC(=O)Cc1nn(Cc2nc3ccccc3o2)c2ccc(Cl)cc12
: