Target
Aldo-keto reductase family 1 member B1
Ligand
BDBM50006481
Substrate
Meas. Tech.
ChEBML_31769
IC50
5.0±n/a nM
Citation
 Mylari, BLZembrowski, WJBeyer, TAAldinger, CESiegel, TW Orally active aldose reductase inhibitors: indazoleacetic, oxopyridazineacetic, and oxopyridopyridazineacetic acid derivatives. J Med Chem 35:2155-62 (1992)  
Target
Name:
Aldo-keto reductase family 1 member B1
Synonyms:
AKR1B1 ALDR_HUMAN AR Aldose Reductase (ALR2) Aldose reductase (AR)
Type:
Protein
Mol. Mass.:
35855.50
Organism:
Homo sapiens (Human)
Description:
P15121. 4LAU; 2IKI; 4LB4; 2FZD; 2FZ8; 1US0
Residue:
316
  
Inhibitor
Name:
BDBM50006481
Synonyms:
CHEMBL73560 | [1-(5,7-Difluoro-benzothiazol-2-ylmethyl)-4,5-dimethyl-6-oxo-1,6-dihydro-pyridazin-3-yl]-acetic acid
Type:
Small organic molecule
Emp. Form.:
C16H13F2N3O3S
Mol. Mass.:
365.355
SMILES:
Cc1c(CC(O)=O)nn(Cc2nc3cc(F)cc(F)c3s2)c(=O)c1C
: