Target
Aromatase
Ligand
BDBM50006552
Substrate
Meas. Tech.
ChEBML_36055
IC50
1200±n/a nM
Citation
 Hartmann, RWBatzl, CPongratz, TMMannschreck, A Synthesis and aromatase inhibition of 3-cycloalkyl-substituted 3-(4-aminophenyl)piperidine-2,6-diones. J Med Chem 35:2210-4 (1992)  
Target
Name:
Aromatase
Synonyms:
ARO1 CP19A_HUMAN CYP19 CYPXIX Cytochrome P450 19A1 Cytochrome P450-C19 (CYP19) FL cytokine receptor precursor | P-450AROM
Type:
Enzyme
Mol. Mass.:
57888.92
Organism:
Homo sapiens (Human)
Description:
P11511
Residue:
503
  
Inhibitor
Name:
BDBM50006552
Synonyms:
3-(4-Amino-phenyl)-3-cyclopentyl-piperidine-2,6-dione | CHEMBL305483
Type:
Small organic molecule
Emp. Form.:
C16H20N2O2
Mol. Mass.:
272.3422
SMILES:
Nc1ccc(cc1)C1(CCC(=O)NC1=O)C1CCCC1
: