Target
Aromatase
Ligand
BDBM50406640
Substrate
Meas. Tech.
ChEBML_36055
IC50
370000±n/a nM
Citation
 Hartmann, RWBatzl, CPongratz, TMMannschreck, A Synthesis and aromatase inhibition of 3-cycloalkyl-substituted 3-(4-aminophenyl)piperidine-2,6-diones. J Med Chem 35:2210-4 (1992)  
Target
Name:
Aromatase
Synonyms:
ARO1 CP19A_HUMAN CYP19 CYPXIX Cytochrome P450 19A1 Cytochrome P450-C19 (CYP19) FL cytokine receptor precursor | P-450AROM
Type:
Enzyme
Mol. Mass.:
57888.92
Organism:
Homo sapiens (Human)
Description:
P11511
Residue:
503
  
Inhibitor
Name:
BDBM50406640
Synonyms:
AMINOGLUTETHIMIDE | CHEMBL1394757
Type:
Small organic molecule
Emp. Form.:
C13H16N2O2
Mol. Mass.:
232.2783
SMILES:
CC[C@]1(CCC(=O)NC1=O)c1ccc(N)cc1
: