Target
M-phase inducer phosphatase 3
Ligand
BDBM50251723
Substrate
Meas. Tech.
ChEBML_1684263
IC50
1000±n/a nM
Citation
 Zwergel, CCzepukojc, BEvain-Bana, EXu, ZStazi, GMori, MPatsilinakos, AMai, ABotta, BRagno, RBagrel, DKirsch, GMeiser, PJacob, CMontenarh, MValente, S Novel coumarin- and quinolinone-based polycycles as cell division cycle 25-A and -C phosphatases inhibitors induce proliferation arrest and apoptosis in cancer cells. Eur J Med Chem 134:316-333 (2017)  
Target
Name:
M-phase inducer phosphatase 3
Synonyms:
CDC25C M-phase inducer phosphatase 3 | MPIP3_HUMAN
Type:
Substrate
Mol. Mass.:
53366.11
Organism:
Homo sapiens (Human)
Description:
P30307
Residue:
473
  
Inhibitor
Name:
BDBM50251723
Synonyms:
CHEMBL4094178
Type:
Small organic molecule
Emp. Form.:
C18H10O4
Mol. Mass.:
290.2696
SMILES:
Cc1ccc2c(c1)oc(=O)c1c3C(=O)C=CC(=O)c3ccc21
: