Target
M-phase inducer phosphatase 3
Ligand
BDBM50251697
Substrate
Meas. Tech.
ChEBML_1684263
IC50
100±n/a nM
Citation
 Zwergel, CCzepukojc, BEvain-Bana, EXu, ZStazi, GMori, MPatsilinakos, AMai, ABotta, BRagno, RBagrel, DKirsch, GMeiser, PJacob, CMontenarh, MValente, S Novel coumarin- and quinolinone-based polycycles as cell division cycle 25-A and -C phosphatases inhibitors induce proliferation arrest and apoptosis in cancer cells. Eur J Med Chem 134:316-333 (2017)  
Target
Name:
M-phase inducer phosphatase 3
Synonyms:
CDC25C M-phase inducer phosphatase 3 | MPIP3_HUMAN
Type:
Substrate
Mol. Mass.:
53366.11
Organism:
Homo sapiens (Human)
Description:
P30307
Residue:
473
  
Inhibitor
Name:
BDBM50251697
Synonyms:
CHEMBL4093222
Type:
Small organic molecule
Emp. Form.:
C21H10O4
Mol. Mass.:
326.3017
SMILES:
O=C1C=CC(=O)c2c1ccc1c3ccc4ccccc4c3oc(=O)c21
: