Target
Thymidylate synthase
Ligand
BDBM50006683
Substrate
Meas. Tech.
ChEBML_225607
IC50
950.0±n/a nM
Citation
 Thornton, TJJackman, ALMarsham, PRO'Connor, BMBishop, JACalvert, AH Quinazoline antifolate thymidylate synthase inhibitors: difluoro-substituted benzene ring analogues. J Med Chem 35:2321-7 (1992)  
Target
Name:
Thymidylate synthase
Synonyms:
TS TYSY_MOUSE | Tyms
Type:
PROTEIN
Mol. Mass.:
34957.15
Organism:
Mus musculus
Description:
ChEMBL_1340097
Residue:
307
  
Inhibitor
Name:
BDBM50006683
Synonyms:
2-{2,6-Difluoro-4-[methyl-(2-methyl-4-oxo-3,4-dihydro-quinazolin-6-ylmethyl)-amino]-benzoylamino}-pentanedioic acid ;hydrate(1.25H2O) | CHEMBL420935
Type:
Small organic molecule
Emp. Form.:
C23H22F2N4O6
Mol. Mass.:
488.4408
SMILES:
CN(Cc1ccc2nc(C)[nH]c(=O)c2c1)c1cc(F)c(C(=O)N[C@@H](CCC(O)=O)C(O)=O)c(F)c1
: