Target
Retinoblastoma-associated protein
Ligand
BDBM50251767
Substrate
Meas. Tech.
ChEBML_1684306
IC50
10000±n/a nM
Citation
 Kulkarni, MRMane, MSGhosh, USharma, RLad, NPSrivastava, AKulkarni-Almeida, AKharkar, PSKhedkar, VMPandit, SS Discovery of tetrahydrocarbazoles as dual pERK and pRb inhibitors. Eur J Med Chem 134:366-378 (2017)  
Target
Name:
Retinoblastoma-associated protein
Synonyms:
RB1 Rb pp110 | retinoblastoma
Type:
Other Protein Type
Mol. Mass.:
106170.80
Organism:
Homo sapiens (Human)
Description:
P06400
Residue:
928
  
Inhibitor
Name:
BDBM50251767
Synonyms:
CHEMBL4092469
Type:
Small organic molecule
Emp. Form.:
C17H22N2
Mol. Mass.:
254.37
SMILES:
C1CCC(C1)NC1CCCc2c1[nH]c1ccccc21
: