Target
Retinoblastoma-associated protein
Ligand
BDBM2579
Substrate
Meas. Tech.
ChEBML_1684306
IC50
66±n/a nM
Citation
 Kulkarni, MRMane, MSGhosh, USharma, RLad, NPSrivastava, AKulkarni-Almeida, AKharkar, PSKhedkar, VMPandit, SS Discovery of tetrahydrocarbazoles as dual pERK and pRb inhibitors. Eur J Med Chem 134:366-378 (2017)  
Target
Name:
Retinoblastoma-associated protein
Synonyms:
RB1 Rb pp110 | retinoblastoma
Type:
Other Protein Type
Mol. Mass.:
106170.80
Organism:
Homo sapiens (Human)
Description:
P06400
Residue:
928
  
Inhibitor
Name:
BDBM2579
Synonyms:
(2S,3R,4R,6R)-3-methoxy-2-methyl-4-(methylamino)-29-oxa-1,7,17-triazaoctacyclo[12.12.2.1^{2,6}.0^{7,28}.0^{8,13}.0^{15,19}.0^{20,27}.0^{21,26}]nonacosa-8(13),9,11,14(28),15(19),20(27),21(26),22,24-nonaen-16-one Staurosporin, 4 Staurosporine, 8 US9206188, Staurosporine | US9226923, Staurosporine
Type:
Small organic molecule
Emp. Form.:
C28H26N4O3
Mol. Mass.:
466.531
SMILES:
CN[C@@H]1C[C@H]2O[C@@](C)([C@@H]1OC)n1c3ccccc3c3c4CNC(=O)c4c4c5ccccc5n2c4c13
: