Target
Retinoblastoma-associated protein
Ligand
BDBM50251808
Substrate
Meas. Tech.
ChEBML_1684306
IC50
>100000±n/a nM
Citation
 Kulkarni, MRMane, MSGhosh, USharma, RLad, NPSrivastava, AKulkarni-Almeida, AKharkar, PSKhedkar, VMPandit, SS Discovery of tetrahydrocarbazoles as dual pERK and pRb inhibitors. Eur J Med Chem 134:366-378 (2017)  
Target
Name:
Retinoblastoma-associated protein
Synonyms:
RB1 Rb pp110 | retinoblastoma
Type:
Other Protein Type
Mol. Mass.:
106170.80
Organism:
Homo sapiens (Human)
Description:
P06400
Residue:
928
  
Inhibitor
Name:
BDBM50251808
Synonyms:
CHEMBL4067615
Type:
Small organic molecule
Emp. Form.:
C17H23ClN2O
Mol. Mass.:
306.83
SMILES:
Cl.C1CC(CCO1)NC1CCc2c(C1)[nH]c1ccccc21
: