Target
Adenosine receptor A1
Ligand
BDBM50006697
Substrate
Meas. Tech.
ChEBML_29623
Ki
58±n/a nM
Citation
 Shimada, JSuzuki, FNonaka, HIshii, AIchikawa, S (E)-1,3-dialkyl-7-methyl-8-(3,4,5-trimethoxystyryl)xanthines: potent and selective adenosine A2 antagonists. J Med Chem 35:2342-5 (1992)  
Target
Name:
Adenosine receptor A1
Synonyms:
AA1R_RAT ADENOSINE A1 high Adenosine A1 receptor (A1) Adenosine receptors A1 | Adora1
Type:
Protein
Mol. Mass.:
36704.13
Organism:
Rattus norvegicus (rat)
Description:
Residue:
326
  
Inhibitor
Name:
BDBM50006697
Synonyms:
8-Phenethyl-1,3-dipropyl-3,7-dihydro-purine-2,6-dione | CHEMBL33115
Type:
Small organic molecule
Emp. Form.:
C19H24N4O2
Mol. Mass.:
340.4195
SMILES:
CCCn1c2nc(CCc3ccccc3)[nH]c2c(=O)n(CCC)c1=O
: